{"text_format":"1","workbook":"xlsx","n_sheets":14,"sheets":["Active-Completed","Development","Proposals","Definitions","Forecast to Budget","In Discussion","Lists","DC'D In D-P","Archieved","Budget Sheet","Pharma Names","Sheet1","Sheet2","Sheet3"],"not_rendered":{"charts":0,"images":0,"macros":1,"external_links":0,"defined_names":213,"comments":1,"pivot_tables":0},"unopened":[],"bounds":{"document_bytes":16777216,"sheet_cells":100000,"rows_first":2000,"rows_last":500,"rows_between":2000,"halvings":0,"cell_chars":16384,"cell_head_chars":4096},"cells_cut":0,"cells_raw":0,"read":"whole","date_system":"1900"}

{"sheet":"Active-Completed","index":0,"n_rows":235,"n_cols":51,"rows_kept":235,"cut":false,"hidden":false,"merged":[[228,0,228,5],[229,0,229,5],[227,0,227,5]]}
["ACTIVE / COMPLETED"]
[null,null,null,null,null,null,null,null,null,null,null,null,null,null,null,null,null,null,null,null,null,"Monthly Results / Estimates for Ramp Up",null,null,null,null,null,null,null,null,null,null,null,"FY 2013"]
["Client","NPAD","Program Name","Product Line","Type","Status","Contract Value","Monthly Value","FY Value","Start Date","Term Date","Expected Program End Date","Renewal Prob%","Target Activity (letters/Pts/$)","Activity       (to Date)","Next Report Due Date","Latest Report Results","PCC #","Comments","blank","ID","2011-09","2011-10","2011-11","2011-12","2012-01","2012-02","2012-03","2012-04","2012-05","2012-06","2012-07","2012-08","2012-09","2012-10","2012-11","2012-12","2013-01","2013-02","2013-03","2013-04","2013-05","2013-06","2013-07","2013-08","Unit Lift","WAC","Tot Rev","Total Purch","Total GP","Comment"]
["Abbott",{"$f":"IF(A4=\"\",\"\",VLOOKUP(A4,'Pharma Names'!$A$2:$B$124,2,FALSE))","v":"MaryT"},"Androgel IVR","Adherence","IVR","Completed",244320,20360,183240,"2012-02-28","2012-12-20","2012-12-31",null,48000,null,"2012-07-15","2012-06-30","9493, 9494","FU on initial call volmue",null,51,null,null,null,null,null,null,11315.5,14592.17,15519.83,14357.57,16084.28,14009.140000000001,12575.23,14994.61,14283.67,14024,null,null,null,null,null,null,null,null,null,null,{"$f":"AT4*AU4*1.2*0.87","v":0},{"$f":"AU4*0.975*AT4","v":0},{"$f":"AV4-AW4","v":0}]
["Abbott",{"$f":"IF(A5=\"\",\"\",VLOOKUP(A5,'Pharma Names'!$A$2:$B$124,2,FALSE))","v":"MaryT"},"Humira Inj Training","RPh Service","SAR","Active",1600000,{"$f":"G5/12","v":133333.33333333334},{"$f":"H5*8","v":1066666.6666666667},"2012-01-17","2012-12-14","2013-12-14",null,null,null,null,null,"N/A","Market Activity Report with Lantus, Victoza? Rx Advisor Data?  Report broken down by all and then by program.  15th of every month",null,45,0,0,0,9030,9150,59430,153420,94360,104770,102685,92970,86187.5,82715,83015,90392.5,86402.5,96960,89557.5,98637.5,80970,92830,75797.5,83497.5,86992.5,null,null,0,0,0]
["Abbott",{"$f":"IF(A6=\"\",\"\",VLOOKUP(A6,'Pharma Names'!$A$2:$B$124,2,FALSE))","v":"MaryT"},"Humira Inj Training (Pre Bill)","RPh Service","SAR","Completed",9000,9000,90000,"2011-11-01","2011-12-31","2011-12-31","NA",null,null,"2012-01-30",null,"N/A","Need volume and $ from inception to Mfar",null,43,0,0,0,0,0,0,null,null,null,null,null,null,null,null,null,null,null,null,null,null,null,null,null,null,null,null,0,0,0]
["Abbott",{"$f":"IF(A7=\"\",\"\",VLOOKUP(A7,'Pharma Names'!$A$2:$B$124,2,FALSE))","v":"MaryT"},"Niaspan/Simcor IVR","Adherence","IVR","Completed",593728,25641.620000000003,{"$f":"IF(J7=K7,H7,(IF(DATE(2012,8,31)<K7,DATE(2012,8,31),K7)-IF(DATE(2011,9,1)>J7,DATE(2011,9,1),J7))/30*H7)","v":311973.04333333333},"2011-06-22","2013-05-01","2012-12-31",null,67200,69109,"2012-02-15","2012-06-30","1924-11-22",null,null,1,12715.5,26762.560000000001,25641.620000000003,19620.98,27087.47,27087.47,23601.5,23661.84,23008.22,20478.21,19851.3,19718.72,18960.8,21546.67,18846.38,19138,null,null,null,null,null,null,null,null,{"$f":"11*1.4*25000","v":384999.99999999994},4,1607759.9999999998,1501499.9999999998,106260,"(25,000 pts heard msg at  11 days)"]
["Abbott",{"$f":"IF(A8=\"\",\"\",VLOOKUP(A8,'Pharma Names'!$A$2:$B$124,2,FALSE))","v":"MaryT"},"Tricor/Trilipix IVR","Adherence","IVR","Completed",586331,15392.8,{"$f":"IF(J8=K8,H8,(IF(DATE(2012,8,31)<K8,DATE(2012,8,31),K8)-IF(DATE(2011,9,1)>J8,DATE(2011,9,1),J8))/30*H8)","v":171373.17333333331},"2011-10-02","2013-05-01","2012-12-31",null,50400,3015,"2012-02-15","2012-06-30","1925-06-10","Tricor expires 7/31/12",null,2,0,10384.240000000002,15392.8,16097.07,10154.450000000001,20354.45,18009.75,17556.29,17811.78,16917.27,17274.34,17690.420000000002,17387.23,18701.53,17827.759999999998,17664.5,null,null,null,null,null,null,null,null,{"$f":"40000*5","v":200000},4.8899999999999997,1021031.9999999998,953549.99999999988,67481.999999999884,"(40,000 pts at 5 days)"]
["Acurian",{"$f":"IF(A9=\"\",\"\",VLOOKUP(A9,'Pharma Names'!$A$2:$B$124,2,FALSE))","v":"GregL"},"Diabetes (DSS1)","Clinical Trials","DM","Completed - 1T",44182,44182,44182,"2012-02-06","2012-02-06","2012-02-06","N/A",null,null,null,null,null,"W199",null,47,null,null,null,null,null,44182,null,null,null,null,null,null,null,null,null,null,null,null,null,null,null,null,null,null,null,null,0,0,0]
["Acurian",{"$f":"IF(A10=\"\",\"\",VLOOKUP(A10,'Pharma Names'!$A$2:$B$124,2,FALSE))","v":"GregL"},"Diabetes (DSS1)","Clinical Trials","DM","Completed - 1T",36000,36000,36000,"2012-02-20","2012-02-20",{"$f":"K10","v":"2012-02-20"},"N/A",null,null,null,null,null,"W230",null,48,null,null,null,null,null,33375,null,null,null,null,null,null,null,null,null,null,null,null,null,null,null,null,null,null,null,null,0,0,0]
{"$rows_left_out":226}
{"sheet":"Development","index":1,"n_rows":35,"n_cols":26,"rows_kept":35,"cut":false,"hidden":false,"merged":[[33,0,33,5],[34,0,34,5]]}
["DEVELOPMENT"]
[]
["Client","NPAD","Program Desc","Product Line","Type","Status","Estimated Contract Value","Estimated Monthly Value","Estimated FY Contract","Target Start Date","Expected Start Date","Expected Term Date","Contract Status","Development Status","Materials Status","Implement Status","RPH Training","Front Door","Outsourced Vendor Contract Status","PCC ID","Weekly Action Item","Blank","2011-09","2011-10","2011-11","Comments"]
["Amylin","MaryT","Bydureon Goodstart","Adherence","GS","Develop",293000,{"$f":"IF(L4=K4,G4,G4/((L4-K4)/30))","v":24082.191780821919},{"$f":"IF(L4=K4,G4,(IF(41517<L4,41517,L4)-K4)/30*H4)","v":243230.13698630137},"2012-06-01","2012-11-01","2013-11-01","Executed","O - Approval","Ordered","Not Started","NA","NA",null,null,"10/30 Script in Amylin review to become unbranded : Letters approved"]
["Boehringer",{"$f":"IF(A5=\"\",\"\",VLOOKUP(A5,'Pharma Names'!$A$2:$B$124,2,FALSE))","v":"VanA"},"Tradjenta/Jentadueto (Patient and MD Mailing)","Education","Other","Develop",5167,{"$f":"IF(L5=K5,G5,G5/((L5-K5)/30))","v":2627.2881355932204},{"$f":"IF(L5=K5,G5,(IF(41517<L5,41517,L5)-K5)/30*H5)","v":5167},"2012-12-31","2013-02-01","2013-04-01","Executed","Complete",null,"Not Started"]
["Daiichi Sankyo","VanA","Welchol","Adherence","GS","Develop",245700,{"$f":"G6/12","v":20475},{"$f":"H6*7","v":143325},"2012-10-31","2013-02-01","2014-01-31","Review","O - Approval","Partial",null,null,null,null,null,"10/2 Letters returned to Daiichi for review, MSA w/mfg  SOW w/Wag    "]
["Daiichi Sankyo","VanA","Benicar","Adherence","GS","Develop",2210600,{"$f":"G7/12","v":184216.66666666666},{"$f":"H7*7","v":1289516.6666666665},"2013-01-01","2013-02-01","2014-01-31","Review","O - Approval"]
["DEY",{"$f":"IF(A8=\"\",\"\",VLOOKUP(A8,'Pharma Names'!$A$2:$B$124,2,FALSE))","v":"CathyP"},"EpiPen & JR","Adherence","IVR","Develop",347000,{"$f":"G8/4","v":86750},{"$f":"H8*5","v":433750},"2012-07-01","2013-02-01",null,"Review","Partial",null,null,null,null,null,null,"10/16 Porgram will start with Adheris in 2012  Contract in Wag legal - Launch delayed to 2013 "]
["J&J (Janssen)",{"$f":"IF(A9=\"\",\"\",VLOOKUP(A9,'Pharma Names'!$A$2:$B$124,2,FALSE))","v":"BrianS"},"Prezista - HIV COE","RPH Service","ADH","Develop",250000,{"$f":"G9/12","v":20833.333333333332},{"$f":"H9*3","v":62500},"2013-03-02","2013-02-01","2014-12-01","Review","Partial",null,"Not Started",null,null,null,null,"10/2 Contract with Janssen AE reporting issue ",null,null,null,null,": F2F NTT IC+ cap, follow up NTT call w/in 7 days, late refill call on all 3 days late,"]
["Sanofi Aventis",{"$f":"IF(A10=\"\",\"\",VLOOKUP(A10,'Pharma Names'!$A$2:$B$124,2,FALSE))","v":"MaryT"},"Apidra - Restock letter","Education",null,"Develop",25000,25000,25000,"2012-07-23","2012-12-01",{"$f":"K10","v":"2012-12-01"},"O - Review","Complete",null,"Not Started",null,null,null,null,"10/30 Sanofi has not finalized MSA. All projects still on hold. Review for effectiveness of this letter as it's now stale. 6/26 No change in SOW review. "]
{"$rows_left_out":26}
{"sheet":"Proposals","index":2,"n_rows":23,"n_cols":20,"rows_kept":23,"cut":false,"hidden":false,"merged":[[20,0,20,5],[21,0,21,5],[22,0,22,5]]}
["Proposed Programs"]
[null,null,null,null,null,null,null,null,null,null,null,null,null,null,null,"Program with Monthly Variability"]
["Client","NPAD","Program Desc","Solution","Product","Status","Estimated Contract Value","Estimated Monthly Value","Estimated FY Value","Target Start Date","Target Term Date","Proba- bility","Pt Counts ","Comments","Blank","ID","2011-09","2011-10","2011-11","2011-12"]
["Daiichi Sankyo","VanA","Benicar MPU","Education","MPU","Proposed",25000,null,null,"2012-09-01"]
["Novartis",{"$f":"IF(A5=\"\",\"\",VLOOKUP(A5,'Pharma Names'!$A$2:$B$124,2,FALSE))","v":"JenL"},"COPD registry mailing","Clinical Trials","DM","Proposed",4000,0,4000,null,null,"Medium",null,null,null,"P79"]
["Teva","MaryT","Copaxone SAR","RPh Service","SAR","Proposed",222380,18532,55596,"2012-09-01","2013-08-31","Low",null,null,null,"P57"]
["Trial Accel./Ballenger",{"$f":"IF(A7=\"\",\"\",VLOOKUP(A7,'Pharma Names'!$A$2:$B$124,2,FALSE))","v":"GregL"},"Diabetic Peripheral Neuropathy","Clinical Trials","DM","Proposed",null,null,null,"2012-04-01","2012-04-01","NA",null,"Requested Rx counts only",null,"P28"]
["Trial Accel./Ballenger",{"$f":"IF(A8=\"\",\"\",VLOOKUP(A8,'Pharma Names'!$A$2:$B$124,2,FALSE))","v":"GregL"},"Hypertriglyceridemia CTR","Clinical Trials","DM","Proposed",2000000,2000000,2000000,"2012-07-23","2012-07-24","NA",1055567]
["Trial Accel./Ballenger","GregL","Merck RA CTR","Clinical Trials","DM","Proposed","TBD",null,null,"2012-07-30","2012-07-30","NA"]
["Trial Accel./Ballenger",{"$f":"IF(A10=\"\",\"\",VLOOKUP(A10,'Pharma Names'!$A$2:$B$124,2,FALSE))","v":"GregL"},"Midodrine","Clinical Trials","DM","Proposed","small",null,null,null,null,"NA",null,null,null,"P84"]
{"$rows_left_out":14}
{"sheet":"Definitions","index":3,"n_rows":157,"n_cols":4,"rows_kept":157,"cut":false,"hidden":true,"merged":[]}
[null,"call in number for anyone off-site from 1411 Lake Cook is 866-309-0558 meeting number *8473748326*"]
[null,"Moderator * 2192*"]
[]
["Active Programs drop-down boxes"]
[]
[null,"Status header:"]
[null,null,"Running","Program is running normally"]
[null,null,"Enrollment stopped","The enrollment limit has been reached; contacts are continuing for those already enrolled"]
[null,null,"Suspended","Contacts have been halted but are expected to resume in the near future"]
[null,null,"Stopped","The program has been stopped recently and is not expected to resume in the near future"]
{"$rows_left_out":148}
{"sheet":"Forecast to Budget","index":4,"n_rows":37,"n_cols":15,"rows_kept":37,"cut":false,"hidden":true,"merged":[[0,0,0,14]]}
["BUDGET ANALYSIS"]
[]
[]
["BUDGET VARIANCE"]
["2012 FY ","2011-09-01","2011-10-01","2011-11-01","YTD","2011-12-01","2012-01-01","2012-02-01","2012-03-01","2012-04-01","2012-05-01","2012-06-01","2012-07-01","2012-08-01","Total"]
["Budget",1062473.58,1062473.58,1062473.58,{"$f":"SUM(B6:D6)","v":3187420.74},1062473.58,885411.79,885411.79,885411.79,1721823.58,1721823.58,1721823.58,1721823.58,1721823.58,{"$f":"SUM(B6:N6)-E6","v":15515247.589999998}]
["Estimated",{"$f":"B8","v":535110.68704994081},871010.52098591544,{"$f":"C7+D24+D37","v":1705708.0209859153},{"$f":"SUM(B7:D7)","v":3111829.2290217718},null,null,null,null,null,null,null,null,null,{"$f":"SUM(B7:N7)","v":6223658.4580435436}]
["Actual",535110.68704994081,null,null,null,null,null,null,null,null,null,null,null,null,{"$f":"SUM(B8:N8)","v":535110.68704994081}]
[]
["VAR (Act)",{"$f":"IF(B8=\"\",B7,B8)-B6","v":-527362.89295005926},{"$f":"IF(C8=\"\",C7,C8)-C6","v":-191463.05901408463},643234.44098591525,-75591.510978228413,-1062473.58,-885411.79,-885411.79,-885411.79,-1721823.58,-1721823.58,-1721823.58,-1721823.58,-1721823.58,-14980136.902950058]
{"$rows_left_out":28}
{"sheet":"In Discussion","index":5,"n_rows":26,"n_cols":9,"rows_kept":26,"cut":false,"hidden":false,"merged":[[23,0,23,5],[24,0,24,5],[25,0,25,5]]}
["IN DISCUSSION"]
[]
["Client","NPAD","Program Desc","Solution","Product","Status","Estimated Contract Value","Estimated Monthly Value","Comments"]
["Abbott",{"$f":"IF(A4=\"\",\"\",VLOOKUP(A4,'Pharma Names'!$A$2:$B$124,2,FALSE))","v":"MaryT"},"Tarka - generic gone - Patient","Education","DM",null,null,null,"with copay card"]
["Acurian",{"$f":"IF(A5=\"\",\"\",VLOOKUP(A5,'Pharma Names'!$A$2:$B$124,2,FALSE))","v":"GregL"},"Rosacea ","Clinical Trials","DM"]
["Acurian",{"$f":"IF(A6=\"\",\"\",VLOOKUP(A6,'Pharma Names'!$A$2:$B$124,2,FALSE))","v":"GregL"},"Parkinson's","Clinical Trials","DM"]
["B&L",{"$f":"IF(A7=\"\",\"\",VLOOKUP(A7,'Pharma Names'!$A$2:$B$124,2,FALSE))","v":"BrianS"},"Portfolio - Store Media","Education","Other",null,100000,{"$f":"G7","v":100000},{"$f":"H7","v":100000}]
["Galderma",{"$f":"IF(A8=\"\",\"\",VLOOKUP(A8,'Pharma Names'!$A$2:$B$124,2,FALSE))","v":"VanA"},"Epi DUO and Oracia","Adherence","Other",null,null,null,"1st Fill issue"]
["J&J (Janssen)",{"$f":"IF(A9=\"\",\"\",VLOOKUP(A9,'Pharma Names'!$A$2:$B$124,2,FALSE))","v":"BrianS"},"Xarelto","RPH Service","ADH",null,250000,{"$f":"G9/12","v":20833.333333333332},{"$f":"H9*3","v":62500}]
["Novartis",{"$f":"IF(A10=\"\",\"\",VLOOKUP(A10,'Pharma Names'!$A$2:$B$124,2,FALSE))","v":"JenL"},"LCQQ908 CV Risk (Hyperlipidemia) study","Clinical Trials","DM",null,null,null,"may include Catalina"]
{"$rows_left_out":17}
{"sheet":"Lists","index":6,"n_rows":17,"n_cols":11,"rows_kept":17,"cut":false,"hidden":true,"merged":[]}
["Product Line","Type","NPAD","Status - A/C","Status - Proposed","Contract","Develop","Materials","Implementation","Probability"]
["90-Day","DM","Brian S.","Active","Develop","Draft","Draft","Complete","Not Started ","Low",{"$f":"D2","v":"Active"}]
["Adherence","E-COM","Cathy P.","Develop","Proposed","Business","Approval","Develop","In Progress","Medium",{"$f":"K2&\",\"&D3","v":"Active,Develop"}]
["Clinical Trials","SAR","Jen L.","Existing Only","Open - Ct","Review","Complete","Ordered","Complete","High",{"$f":"K3&\",\"&D4","v":"Active,Develop,Existing Only"}]
["RPh Service","INJ TR","Mary T.","Completed","Complete - Ct","Sign","O - Draft","Partial",null,"NA","Active,Develop,Existing Only,Completed"]
["Data","Data","Van A.","Completed - 1T",null,"Ctr-Sig","O - Approval","Not Started",null,null,{"$f":"K5&\",\"&D7","v":"Active,Develop,Existing Only,Completed,Hold"}]
["Education","MPU","NA","Hold",null,"Executed","Partial","NA",null,null,"Active,Develop,Existing Only,Completed,Hold,Canceled - E"]
["Marketing","REB",null,"Canceled - E",null,"Hold","Not Started",null,null,null,"Active,Develop,Existing Only,Completed,Hold,Canceled - E,Canceled - I"]
["Outcomes","ADH",null,"Canceled - I",null,"O - Draft","NA",null,null,null,"Active,Develop,Existing Only,Completed,Hold,Canceled - E,Canceled - I,Off - Budget"]
["PSC","Adheris",null,"Off - Budget",null,"O - Review",null,null,null,null,"Active,Develop,Existing Only,Completed,Hold,Canceled - E,Canceled - I,Off - Budget,Off - Revise"]
{"$rows_left_out":8}
{"sheet":"DC'D In D-P","index":7,"n_rows":84,"n_cols":46,"rows_kept":84,"cut":false,"hidden":false,"merged":[]}
["Client","NPAD","Program Desc","Solution","Product","Status","Estimated Contract Value","Estimated Monthly Value","Estimated FY Contract","Target Start Date","Expected Start Date","Expected Term Date","Contract Status","Development Status","Materials Status","Implement Status","RPH Training","Front Door","Outsourced Vendor Contract Status","PCC ID","Comments","ID","2011-09","2011-10","2011-11","2011-12","2012-01","2012-02","2012-03","2012-04","2012-05","2012-06","2012-07","2012-08","2012-09","2012-10","2012-11","2012-12","2013-01","2013-02","2013-03","2013-04","2013-05","2013-06","2013-07","2013-08"]
["Sanofi Aventis",{"$f":"IF(A2=\"\",\"\",VLOOKUP(A2,'Pharma Names'!$A$2:$B$124,2,FALSE))","v":"MaryT"},"Multaq","ADH","Direct Mail","Canceled - E",40822,{"$f":"G2/12","v":3401.8333333333335},{"$f":"H2*9","v":30616.5},"2011-12-01",{"$f":"J2","v":"2011-12-01"},"2012-11-30","O - Hold","Complete","Complete","Not Started","NA","NA","NA",null,"The program is discontinued, eff. 11/7/11 per Sanofi.  Drug Saftey Issue\n","D14"]
["Acurian",{"$f":"IF(A3=\"\",\"\",VLOOKUP(A3,'Pharma Names'!$A$2:$B$124,2,FALSE))","v":"GregL"},"Depression","CTR","Direct Mail","Proposed",30000,30000,30000,"2011-12-30","2011-12-30","Low",null,null,null,"P2",null,null,null,null,"Decided on by PDMA RSG"]
["Acurian",{"$f":"IF(A4=\"\",\"\",VLOOKUP(A4,'Pharma Names'!$A$2:$B$124,2,FALSE))","v":"GregL"},"Major Depressive Disorder","CTR","Direct Mail","Proposed","TBD","TBD","TBD",null,null,"Low",null,"Requested national counts by Zip",null,"P31",null,null,null,null,"Decided on by PDMA RSG"]
["Ballenger",{"$f":"IF(A5=\"\",\"\",VLOOKUP(A5,'Pharma Names'!$A$2:$B$124,2,FALSE))","v":{"$error":"#N/A"}},"Depression (SSRI's & SNRI's) ","CTR","Direct Mail","Proposed","TBD","TBD","TBD",null,null,"Low",null,"Requested Rx counts only",null,"P29",null,null,null,null,"Decided on by PDMA RSG"]
["Ballenger",{"$f":"IF(A6=\"\",\"\",VLOOKUP(A6,'Pharma Names'!$A$2:$B$124,2,FALSE))","v":{"$error":"#N/A"}},"Depression","CTR","Direct Mail","Proposed",50000,{"$f":"G6/((K6-J6)/30+1)","v":50000},{"$f":"G6","v":50000},"2012-01-15","2012-01-15","Low",null,null,null,"P6",null,null,null,null,"Decided on by PDMA RSG"]
["Novartis",{"$f":"IF(A7=\"\",\"\",VLOOKUP(A7,'Pharma Names'!$A$2:$B$124,2,FALSE))","v":"JenL"},"Tekturna products","ADH","Direct Mail","Develop",320000,{"$f":"G7/12","v":26666.666666666668},{"$f":"H7*9","v":240000},"2011-11-01","2011-12-01","2012-11-30","Executed","Complete","Ordered","Started ","NA","NA","NA",null,"Programs DC'ed until further notice due to negative study"]
["Actavis",{"$f":"IF(A8=\"\",\"\",VLOOKUP(A8,'Pharma Names'!$A$2:$B$124,2,FALSE))","v":"VanA"},"Opana ER Generic 7.5mg & 15mg - Pt Letter","EDU","Direct Mail","Develop",{"$f":"1000*2.5","v":2500},{"$f":"G8","v":2500},{"$f":"H8","v":2500},"2011-12-10","2012-01-23",{"$f":"K8","v":"2012-01-23"},"Review","Approval","Not Started","Not Started","NA","NA","NA",null,"1/24/2012 Cancelled Program"]
["Boehringer",{"$f":"IF(A9=\"\",\"\",VLOOKUP(A9,'Pharma Names'!$A$2:$B$124,2,FALSE))","v":"VanA"},"Tradjenta Met - Fixed Dose MD Mailing","EDU","Direct Mail","Proposed",20000,20000,20000,"2012-02-15","2012-04-01","2012-02-25","O - Review","Draft","Ordered","Not Started","NA","NA","NA",null,"3/27/2012 -  Contract in review ",null,"D27"]
["Sunovion","VanA","Brovana Rph Alert","EDU","Other","Canceled - E",25000,25000,25000,"2012-03-19","2012-03-26","2012-03-26","Review","Complete","NA","Not Started","NA","NA","NA",null,"Dead Deal "]
{"$rows_left_out":75}
{"sheet":"Archieved","index":8,"n_rows":58,"n_cols":19,"rows_kept":58,"cut":false,"hidden":true,"merged":[[0,0,0,18]]}
["Archived Programs (Completed prior to FY'12)"]
[]
["Client","Program Name","Solution","Product","Status","NPAD","Estimated Contract Value","Estimated Monthly Value","Estimated FY Contract","Target Start Date","Expiration Date","Renewal Process","Target Enrollment","Enrollment to Date","Contract to Date Activity","Next Report Due Date","Latest Report Results","PCC #","Comments"]
["GSK","Vesicare","ADH","Direct Mail","Completed","NA",106139.8,null,null,"2010-02-09","2010-08-12",null,"(80,190 ltrs)",null,null,null,8333]
["Novartis","Diovan, Diovan HCT","ADH","Direct Mail","Completed","NA",1487307.9500000002,null,null,"2009-07-06","2010-10-13",null,null,null,null,null,"8233 & 8234"]
["GSK","Lovaza","ADH","Direct Mail","Completed","NA",771004.84000000008,null,null,"2009-04-23","2010-12-15",null,52200,null,null,null,"8193"]
["Lilly","Strattera","ADH","Direct Mail","Completed","NA",70697.45,null,null,"2010-04-09","2010-12-16",null,"(96,154 ltrs)",null,null,null,8096]
["Amylin","Byetta","ADH","Direct Mail","Completed","NA",97474,null,null,"2010-02-19","2010-12-31",null,22500,null,null,null,8275]
["Lilly","Cymbalta","ADH","Direct Mail","Completed","NA",645041.80000000005,null,null,"2009-02-01","2011-01-11",null,104500,null,null,null,7493,"(324,368 ltrs)"]
["Sanofi-BMS","Plavix Zero Refill","ADH","Direct Mail","Completed","NA",48942.400000000001,null,null,"2010-08-02","2010-12-31",null,75000,null,null,null,8285]
{"$rows_left_out":49}
{"sheet":"Budget Sheet","index":9,"n_rows":76,"n_cols":48,"rows_kept":76,"cut":false,"hidden":false,"merged":[[46,0,46,2],[60,0,60,7],[2,0,2,14],[0,0,0,14],[1,0,1,14],[5,11,5,14],[5,5,5,9],[5,0,5,3],[40,0,40,9],[24,0,24,3]]}
["FY'13 Accrual to Budget Report"]
["Retail Trade Strategy"]
["(accrual values on this report are not adjusted to match invoices or receivables)"]
[]
[]
["Revenue: YTD",null,null,null,null,"Gross Profit YTD",null,null,null,null,null,"Full FY Projected"]
["Service","Revenue","BUDGET","VAR",null,"GP%","Budg GP%","GP $","Budg GP $","GP Var",null,"Service","Revenue","FY GP%","GP"]
[{"$f":"A27","v":"Adherence"},{"$f":"SUM(B27:M27)","v":7833898.7400000002},{"$f":"SUM(B65:M65)","v":10820000},{"$f":"B8-C8","v":-2986101.26},null,0.56000000000000005,{"$f":"F8","v":0.56000000000000005},{"$f":"F8*B8","v":4386983.2944000009},{"$f":"C8*G8","v":6059200.0000000009},{"$f":"H8-I8","v":-1672216.7056},null,"+Adherence",{"$f":"B8+INDEX(B27:M27,MATCH(9.99999999999999E+307,B27:M27))*COUNTBLANK(B27:M27)","v":9848238.3800000008},{"$f":"O8/M8","v":0.56000000000000005},{"$f":"M8*F8","v":5515013.4928000011}]
["RPh Service",3358691.6,3333333.3333333335,25358.266666666605,null,0.67,0.7,2250323.372,2333333.3333333335,{"$f":"H9-I9","v":-83009.961333333515},null,"RPh Service",{"$f":"B9+INDEX(B28:M28,MATCH(9.99999999999999E+307,B28:M28))*COUNTBLANK(B28:M28)","v":3907379.8},{"$f":"O9/M9","v":0.67},{"$f":"M9*F9","v":2617944.466}]
["Clinical Trials",954759,2900000,-1945241,null,0.45,0.7,429641.55,2029999.9999999998,-1600358.4499999997,null,"Clinical Research",{"$f":"B10+INDEX(B29:M29,MATCH(9.99999999999999E+307,B29:M29))*COUNTBLANK(B29:M29)+250000","v":1507675},{"$f":"1-0.55","v":0.44999999999999996},{"$f":"N10*M10","v":678453.74999999988}]
{"$rows_left_out":67}
{"sheet":"Pharma Names","index":10,"n_rows":125,"n_cols":2,"rows_kept":125,"cut":false,"hidden":true,"merged":[]}
["Pharma","NPAD"]
["Abbott","MaryT"]
["Access","BrianS"]
["Acorda","Specialty"]
["Actavis","VanA"]
["Actelion","JenL"]
["Actient","CathyP"]
["Acurian","GregL"]
["Alexion","Specialty"]
["Alkermes","Specialty"]
{"$rows_left_out":116}
{"sheet":"Sheet1","index":11,"n_rows":0,"n_cols":0,"rows_kept":0,"cut":false,"hidden":true,"merged":[]}

{"sheet":"Sheet2","index":12,"n_rows":0,"n_cols":0,"rows_kept":0,"cut":false,"hidden":true,"merged":[]}

{"sheet":"Sheet3","index":13,"n_rows":33,"n_cols":15,"rows_kept":33,"cut":false,"hidden":true,"merged":[]}
[null,"2011-09","2011-10","2011-11","2011-12","2012-01","2012-02","2012-03","2012-04","2012-05","2012-06","2012-07","2012-08",null,"Totals"]
["Total Revenue",542160.68999999994,833456.78657986142,1552619.5304089012,729506.45,700957.64,1102602.54,1110045.96,1321756.7199999997,{"$f":"J19","v":920000},{"$f":"K19","v":1036000},{"$f":"L19","v":1246000},{"$f":"M19","v":1346000},null,{"$f":"SUM(B2:M2)","v":12441106.316988762}]
["Budget",1062473.58,1062473.58,1062473.58,1062473.58,885411.79,885411.79,885411.79,1721823.58,1721823.58,1721823.58,1721823.58,1721823.58,null,{"$f":"SUM(B3:M3)","v":15515247.59}]
["Variance",-520312.89000000013,-229016.79342013865,490145.95040890109,-332967.13000000012,-184454.15000000002,217190.75,224634.16999999993,-400066.86000000034,{"$f":"J2-J3","v":-801823.58000000007},{"$f":"K2-K3","v":-685823.58000000007},{"$f":"L2-L3","v":-475823.58000000007},{"$f":"M2-M3","v":-375823.58000000007},null,{"$f":"O3-O2","v":3074141.2730112374}]
[]
["Total Running Sums",542160.68999999994,1375617.4765798612,2928237.0069887624,3657743.4569887621,4358701.0969887618,5461303.6369887618,6571349.5969887618,7893106.3169887615,{"$f":"I6+J2","v":8813106.3169887625},{"$f":"J6+K2","v":9849106.3169887625},{"$f":"K6+L2","v":11095106.316988762},{"$f":"L6+M2","v":12441106.316988762}]
["Budget Running Sums",1062473.58,2124947.16,3187420.74,4249894.32,5135306.1100000003,6020717.9000000004,6906129.6900000004,8627953.2699999996,10349776.85,12071600.43,13793424.01,15515247.59]
["Variance (running)",-520312.89000000013,-749329.6834201389,-259183.73301123781,-592150.86301123817,-776605.01301123854,-559414.26301123854,-334780.09301123861,-734846.95301123802,{"$f":"I8+J4","v":-1536670.5330112381},{"$f":"J8+K4","v":-2222494.1130112382},{"$f":"K8+L4","v":-2698317.6930112382},{"$f":"L8+M4","v":-3074141.2730112383}]
[]
["Expected Revenue"]
{"$rows_left_out":23}