{"text_format":"1","workbook":"xlsx","n_sheets":4,"sheets":["Template","Reversing template","Account code","Sheet3"],"not_rendered":{"charts":0,"images":1,"macros":1,"external_links":0,"defined_names":2,"comments":0,"pivot_tables":0},"unopened":[],"bounds":{"document_bytes":16777216,"sheet_cells":100000,"rows_first":2000,"rows_last":500,"rows_between":2000,"halvings":0,"cell_chars":16384,"cell_head_chars":4096},"cells_cut":0,"cells_raw":0,"read":"whole","date_system":"1900"}

{"sheet":"Template","index":0,"n_rows":49,"n_cols":26,"rows_kept":49,"cut":false,"hidden":false,"merged":[[10,2,10,6],[5,0,5,1],[6,0,6,1],[7,0,7,1],[8,0,8,1],[9,0,9,1],[10,0,10,1]]}
[null,null,null,null,null,"Prepared by:",null,"Date:",null,"Press Ctrl-J to create Journal",null,null,null,null,null,null,null,null,null,null,null,null,null,null,null,"Y"]
[null,null,null,null,null,null,null,null,null,null,null,null,null,null,null,null,null,null,null,null,null,null,null,null,null,"N"]
[null,null,null,null,null,"Reviewed by:",null,"Date:"]
[]
[]
["Journal Ref",null,"JL101231000067"]
["Base Currency",null,"USD"]
["Entity",null,100]
["Rflag",null,"N"]
["Effective date",null,"2010-12-31"]
["Purpose",null,"To correct Celgene revenue SOW2"]
["Accrual (Y/N)",null,"N","Reverse in next period",null,"N",{"$f":"IF(F12=\"Y\",IF('Reversing template'!C6=\"\",\"Missing Entry\",'Reversing template'!C6),\"N/A\")","v":"N/A"},null,{"$f":"IF(H14=I14,\"\",\"Out of balance\")","v":""},{"$f":"IF(H14=I14,\"\",H14-I14)","v":""}]
[]
[null,null,null,null,null,null,"Voucher Total",{"$f":"SUM(H17:H65536)","v":268095},{"$f":"SUM(I17:I65536)","v":268095}]
[]
[null,"Account","Account Name","Cost Center","Project","Description",null,"Debit","Credit"]
[null,4010,{"$f":"IF(B17=\"\",\"\",VLOOKUP(B17,'Account code'!A:B,2,FALSE))","v":"Revenue - Study"},null,"CEL00002","Rec rev SOW2 Q410",null,268095]
[null,2150,{"$f":"IF(B18=\"\",\"\",VLOOKUP(B18,'Account code'!A:B,2,FALSE))","v":"Deferred Revenues"},null,"CEL00002","Rec rev SOW2 Q410",null,null,268095]
[null,null,{"$f":"IF(B19=\"\",\"\",VLOOKUP(B19,'Account code'!A:B,2,FALSE))","v":""}]
[null,null,{"$f":"IF(B20=\"\",\"\",VLOOKUP(B20,'Account code'!A:B,2,FALSE))","v":""}]
[null,null,{"$f":"IF(B21=\"\",\"\",VLOOKUP(B21,'Account code'!A:B,2,FALSE))","v":""}]
[null,null,{"$f":"IF(B22=\"\",\"\",VLOOKUP(B22,'Account code'!A:B,2,FALSE))","v":""}]
[null,null,{"$f":"IF(B23=\"\",\"\",VLOOKUP(B23,'Account code'!A:B,2,FALSE))","v":""}]
[null,null,{"$f":"IF(B24=\"\",\"\",VLOOKUP(B24,'Account code'!A:B,2,FALSE))","v":""}]
[null,null,{"$f":"IF(B25=\"\",\"\",VLOOKUP(B25,'Account code'!A:B,2,FALSE))","v":""}]
[null,null,{"$f":"IF(B26=\"\",\"\",VLOOKUP(B26,'Account code'!A:B,2,FALSE))","v":""}]
[null,null,{"$f":"IF(B27=\"\",\"\",VLOOKUP(B27,'Account code'!A:B,2,FALSE))","v":""}]
[null,null,{"$f":"IF(B28=\"\",\"\",VLOOKUP(B28,'Account code'!A:B,2,FALSE))","v":""}]
[null,null,{"$f":"IF(B29=\"\",\"\",VLOOKUP(B29,'Account code'!A:B,2,FALSE))","v":""}]
[null,null,{"$f":"IF(B30=\"\",\"\",VLOOKUP(B30,'Account code'!A:B,2,FALSE))","v":""}]
[null,null,{"$f":"IF(B31=\"\",\"\",VLOOKUP(B31,'Account code'!A:B,2,FALSE))","v":""}]
[null,null,{"$f":"IF(B32=\"\",\"\",VLOOKUP(B32,'Account code'!A:B,2,FALSE))","v":""}]
[null,null,{"$f":"IF(B33=\"\",\"\",VLOOKUP(B33,'Account code'!A:B,2,FALSE))","v":""}]
[null,null,{"$f":"IF(B34=\"\",\"\",VLOOKUP(B34,'Account code'!A:B,2,FALSE))","v":""}]
[null,null,{"$f":"IF(B35=\"\",\"\",VLOOKUP(B35,'Account code'!A:B,2,FALSE))","v":""}]
[null,null,{"$f":"IF(B36=\"\",\"\",VLOOKUP(B36,'Account code'!A:B,2,FALSE))","v":""}]
[null,null,{"$f":"IF(B37=\"\",\"\",VLOOKUP(B37,'Account code'!A:B,2,FALSE))","v":""}]
[null,null,{"$f":"IF(B38=\"\",\"\",VLOOKUP(B38,'Account code'!A:B,2,FALSE))","v":""}]
[null,null,{"$f":"IF(B39=\"\",\"\",VLOOKUP(B39,'Account code'!A:B,2,FALSE))","v":""}]
[null,null,{"$f":"IF(B40=\"\",\"\",VLOOKUP(B40,'Account code'!A:B,2,FALSE))","v":""}]
{"$rows_left_out":10}
{"sheet":"Reversing template","index":1,"n_rows":50,"n_cols":26,"rows_kept":50,"cut":false,"hidden":false,"merged":[[9,0,9,1],[10,0,10,1],[10,2,10,3],[5,0,5,1],[6,0,6,1],[7,0,7,1],[8,0,8,1]]}
[null,null,null,null,null,"Prepared by:",null,"Date:",null,"Press Ctrl-r to create Reversing journal",null,null,null,null,null,null,null,null,null,null,null,null,null,null,null,"Y"]
[null,null,null,null,null,null,null,null,null,null,null,null,null,null,null,null,null,null,null,null,null,null,null,null,null,"N"]
[null,null,null,null,null,"Reviewed by:",null,"Date:"]
[]
[]
["Journal Ref",null,"JLR07083100003"]
["Base Currency",null,"USD"]
["Entity",null,100]
["Rflag",null,"N"]
["Effective date",null,"2007-09-01"]
["Purpose",null,"To reverse JV reference",null,{"$f":"IF(Template!F12=\"Y\",Template!C6,\"\")","v":""}]
["Accrual (Y/N)",null,"N",null,null,null,null,{"$f":"IF(H14=I14,\"\",\"Out of balance\")","v":{"$error":"#REF!"}}]
[]
[null,null,null,null,null,null,"Voucher Total",{"$f":"SUM(H17:H65536)","v":{"$error":"#REF!"}},{"$f":"SUM(I17:I65536)","v":{"$error":"#REF!"}}]
[]
[null,"Account","Account Name","Cost Center","Project","Description",null,"Debit","Credit"]
[null,{"$f":"IF(Template!B17=\"\",\"\",IF(Template!$F$12=\"Y\",Template!B17,\"\"))","v":""},{"$f":"IF(B17=\"\",\"\",VLOOKUP(B17,'Account code'!A:B,2,FALSE))","v":""},{"$f":"IF($B17=\"\",\"\",IF(Template!D17=\"\",\"\",Template!D17))","v":""},{"$f":"IF($B17=\"\",\"\",IF(Template!E17=\"\",\"\",Template!E17))","v":""},{"$f":"IF($B17=\"\",\"\",IF(Template!F17=\"\",\"\",Template!F17))","v":""},null,{"$f":"IF(B17=\"\",\"\",IF(Template!I17=\"\",\"\",Template!I17))","v":""},{"$f":"IF($B17=\"\",\"\",IF(Template!H17=\"\",\"\",Template!H17))","v":""}]
[null,{"$f":"IF(Template!B20=\"\",\"\",IF(Template!$F$12=\"Y\",Template!B20,\"\"))","v":""},{"$f":"IF(B18=\"\",\"\",VLOOKUP(B18,'Account code'!A:B,2,FALSE))","v":""},{"$f":"IF($B18=\"\",\"\",IF(Template!D20=\"\",\"\",Template!D20))","v":""},{"$f":"IF($B18=\"\",\"\",IF(Template!E20=\"\",\"\",Template!E20))","v":""},{"$f":"IF($B18=\"\",\"\",IF(Template!F20=\"\",\"\",Template!F20))","v":""},null,{"$f":"IF(B18=\"\",\"\",IF(Template!I20=\"\",\"\",Template!I20))","v":""},{"$f":"IF($B18=\"\",\"\",IF(Template!H20=\"\",\"\",Template!H20))","v":""}]
[null,{"$f":"IF(Template!#REF!=\"\",\"\",IF(Template!$F$12=\"Y\",Template!#REF!,\"\"))","v":{"$error":"#REF!"}},{"$f":"IF(B19=\"\",\"\",VLOOKUP(B19,'Account code'!A:B,2,FALSE))","v":{"$error":"#REF!"}},{"$f":"IF($B19=\"\",\"\",IF(Template!#REF!=\"\",\"\",Template!#REF!))","v":{"$error":"#REF!"}},{"$f":"IF($B19=\"\",\"\",IF(Template!#REF!=\"\",\"\",Template!#REF!))","v":{"$error":"#REF!"}},{"$f":"IF($B19=\"\",\"\",IF(Template!#REF!=\"\",\"\",Template!#REF!))","v":{"$error":"#REF!"}},null,{"$f":"IF(B19=\"\",\"\",IF(Template!#REF!=\"\",\"\",Template!#REF!))","v":{"$error":"#REF!"}},{"$f":"IF($B19=\"\",\"\",IF(Template!#REF!=\"\",\"\",Template!#REF!))","v":{"$error":"#REF!"}}]
[null,{"$f":"IF(Template!#REF!=\"\",\"\",IF(Template!$F$12=\"Y\",Template!#REF!,\"\"))","v":{"$error":"#REF!"}},{"$f":"IF(B20=\"\",\"\",VLOOKUP(B20,'Account code'!A:B,2,FALSE))","v":{"$error":"#REF!"}},{"$f":"IF($B20=\"\",\"\",IF(Template!#REF!=\"\",\"\",Template!#REF!))","v":{"$error":"#REF!"}},{"$f":"IF($B20=\"\",\"\",IF(Template!#REF!=\"\",\"\",Template!#REF!))","v":{"$error":"#REF!"}},{"$f":"IF($B20=\"\",\"\",IF(Template!#REF!=\"\",\"\",Template!#REF!))","v":{"$error":"#REF!"}},null,{"$f":"IF(B20=\"\",\"\",IF(Template!#REF!=\"\",\"\",Template!#REF!))","v":{"$error":"#REF!"}},{"$f":"IF($B20=\"\",\"\",IF(Template!#REF!=\"\",\"\",Template!#REF!))","v":{"$error":"#REF!"}}]
[null,{"$f":"IF(Template!#REF!=\"\",\"\",IF(Template!$F$12=\"Y\",Template!#REF!,\"\"))","v":{"$error":"#REF!"}},{"$f":"IF(B21=\"\",\"\",VLOOKUP(B21,'Account code'!A:B,2,FALSE))","v":{"$error":"#REF!"}},{"$f":"IF($B21=\"\",\"\",IF(Template!#REF!=\"\",\"\",Template!#REF!))","v":{"$error":"#REF!"}},{"$f":"IF($B21=\"\",\"\",IF(Template!#REF!=\"\",\"\",Template!#REF!))","v":{"$error":"#REF!"}},{"$f":"IF($B21=\"\",\"\",IF(Template!#REF!=\"\",\"\",Template!#REF!))","v":{"$error":"#REF!"}},null,{"$f":"IF(B21=\"\",\"\",IF(Template!#REF!=\"\",\"\",Template!#REF!))","v":{"$error":"#REF!"}},{"$f":"IF($B21=\"\",\"\",IF(Template!#REF!=\"\",\"\",Template!#REF!))","v":{"$error":"#REF!"}}]
[null,{"$f":"IF(Template!B21=\"\",\"\",IF(Template!$F$12=\"Y\",Template!B21,\"\"))","v":""},{"$f":"IF(B22=\"\",\"\",VLOOKUP(B22,'Account code'!A:B,2,FALSE))","v":""},{"$f":"IF($B22=\"\",\"\",IF(Template!D21=\"\",\"\",Template!D21))","v":""},{"$f":"IF($B22=\"\",\"\",IF(Template!E21=\"\",\"\",Template!E21))","v":""},{"$f":"IF($B22=\"\",\"\",IF(Template!F21=\"\",\"\",Template!F21))","v":""},null,{"$f":"IF(B22=\"\",\"\",IF(Template!I21=\"\",\"\",Template!I21))","v":""},{"$f":"IF($B22=\"\",\"\",IF(Template!H21=\"\",\"\",Template!H21))","v":""}]
[null,{"$f":"IF(Template!B22=\"\",\"\",IF(Template!$F$12=\"Y\",Template!B22,\"\"))","v":""},{"$f":"IF(B23=\"\",\"\",VLOOKUP(B23,'Account code'!A:B,2,FALSE))","v":""},{"$f":"IF($B23=\"\",\"\",IF(Template!D22=\"\",\"\",Template!D22))","v":""},{"$f":"IF($B23=\"\",\"\",IF(Template!E22=\"\",\"\",Template!E22))","v":""},{"$f":"IF($B23=\"\",\"\",IF(Template!F22=\"\",\"\",Template!F22))","v":""},null,{"$f":"IF(B23=\"\",\"\",IF(Template!I22=\"\",\"\",Template!I22))","v":""},{"$f":"IF($B23=\"\",\"\",IF(Template!H22=\"\",\"\",Template!H22))","v":""}]
[null,{"$f":"IF(Template!B23=\"\",\"\",IF(Template!$F$12=\"Y\",Template!B23,\"\"))","v":""},{"$f":"IF(B24=\"\",\"\",VLOOKUP(B24,'Account code'!A:B,2,FALSE))","v":""},{"$f":"IF($B24=\"\",\"\",IF(Template!D23=\"\",\"\",Template!D23))","v":""},{"$f":"IF($B24=\"\",\"\",IF(Template!E23=\"\",\"\",Template!E23))","v":""},{"$f":"IF($B24=\"\",\"\",IF(Template!F23=\"\",\"\",Template!F23))","v":""},null,{"$f":"IF(B24=\"\",\"\",IF(Template!I23=\"\",\"\",Template!I23))","v":""},{"$f":"IF($B24=\"\",\"\",IF(Template!H23=\"\",\"\",Template!H23))","v":""}]
[null,{"$f":"IF(Template!B24=\"\",\"\",IF(Template!$F$12=\"Y\",Template!B24,\"\"))","v":""},{"$f":"IF(B25=\"\",\"\",VLOOKUP(B25,'Account code'!A:B,2,FALSE))","v":""},{"$f":"IF($B25=\"\",\"\",IF(Template!D24=\"\",\"\",Template!D24))","v":""},{"$f":"IF($B25=\"\",\"\",IF(Template!E24=\"\",\"\",Template!E24))","v":""},{"$f":"IF($B25=\"\",\"\",IF(Template!F24=\"\",\"\",Template!F24))","v":""},null,{"$f":"IF(B25=\"\",\"\",IF(Template!I24=\"\",\"\",Template!I24))","v":""},{"$f":"IF($B25=\"\",\"\",IF(Template!H24=\"\",\"\",Template!H24))","v":""}]
[null,{"$f":"IF(Template!B25=\"\",\"\",IF(Template!$F$12=\"Y\",Template!B25,\"\"))","v":""},{"$f":"IF(B26=\"\",\"\",VLOOKUP(B26,'Account code'!A:B,2,FALSE))","v":""},{"$f":"IF($B26=\"\",\"\",IF(Template!D25=\"\",\"\",Template!D25))","v":""},{"$f":"IF($B26=\"\",\"\",IF(Template!E25=\"\",\"\",Template!E25))","v":""},{"$f":"IF($B26=\"\",\"\",IF(Template!F25=\"\",\"\",Template!F25))","v":""},null,{"$f":"IF(B26=\"\",\"\",IF(Template!I25=\"\",\"\",Template!I25))","v":""},{"$f":"IF($B26=\"\",\"\",IF(Template!H25=\"\",\"\",Template!H25))","v":""}]
[null,{"$f":"IF(Template!B26=\"\",\"\",IF(Template!$F$12=\"Y\",Template!B26,\"\"))","v":""},{"$f":"IF(B27=\"\",\"\",VLOOKUP(B27,'Account code'!A:B,2,FALSE))","v":""},{"$f":"IF($B27=\"\",\"\",IF(Template!D26=\"\",\"\",Template!D26))","v":""},{"$f":"IF($B27=\"\",\"\",IF(Template!E26=\"\",\"\",Template!E26))","v":""},{"$f":"IF($B27=\"\",\"\",IF(Template!F26=\"\",\"\",Template!F26))","v":""},null,{"$f":"IF(B27=\"\",\"\",IF(Template!I26=\"\",\"\",Template!I26))","v":""},{"$f":"IF($B27=\"\",\"\",IF(Template!H26=\"\",\"\",Template!H26))","v":""}]
[null,{"$f":"IF(Template!B27=\"\",\"\",IF(Template!$F$12=\"Y\",Template!B27,\"\"))","v":""},{"$f":"IF(B28=\"\",\"\",VLOOKUP(B28,'Account code'!A:B,2,FALSE))","v":""},{"$f":"IF($B28=\"\",\"\",IF(Template!D27=\"\",\"\",Template!D27))","v":""},{"$f":"IF($B28=\"\",\"\",IF(Template!E27=\"\",\"\",Template!E27))","v":""},{"$f":"IF($B28=\"\",\"\",IF(Template!F27=\"\",\"\",Template!F27))","v":""},null,{"$f":"IF(B28=\"\",\"\",IF(Template!I27=\"\",\"\",Template!I27))","v":""},{"$f":"IF($B28=\"\",\"\",IF(Template!H27=\"\",\"\",Template!H27))","v":""}]
[null,{"$f":"IF(Template!B28=\"\",\"\",IF(Template!$F$12=\"Y\",Template!B28,\"\"))","v":""},{"$f":"IF(B29=\"\",\"\",VLOOKUP(B29,'Account code'!A:B,2,FALSE))","v":""},{"$f":"IF($B29=\"\",\"\",IF(Template!D28=\"\",\"\",Template!D28))","v":""},{"$f":"IF($B29=\"\",\"\",IF(Template!E28=\"\",\"\",Template!E28))","v":""},{"$f":"IF($B29=\"\",\"\",IF(Template!F28=\"\",\"\",Template!F28))","v":""},null,{"$f":"IF(B29=\"\",\"\",IF(Template!I28=\"\",\"\",Template!I28))","v":""},{"$f":"IF($B29=\"\",\"\",IF(Template!H28=\"\",\"\",Template!H28))","v":""}]
[null,{"$f":"IF(Template!B29=\"\",\"\",IF(Template!$F$12=\"Y\",Template!B29,\"\"))","v":""},{"$f":"IF(B30=\"\",\"\",VLOOKUP(B30,'Account code'!A:B,2,FALSE))","v":""},{"$f":"IF($B30=\"\",\"\",IF(Template!D29=\"\",\"\",Template!D29))","v":""},{"$f":"IF($B30=\"\",\"\",IF(Template!E29=\"\",\"\",Template!E29))","v":""},{"$f":"IF($B30=\"\",\"\",IF(Template!F29=\"\",\"\",Template!F29))","v":""},null,{"$f":"IF(B30=\"\",\"\",IF(Template!I29=\"\",\"\",Template!I29))","v":""},{"$f":"IF($B30=\"\",\"\",IF(Template!H29=\"\",\"\",Template!H29))","v":""}]
[null,{"$f":"IF(Template!B30=\"\",\"\",IF(Template!$F$12=\"Y\",Template!B30,\"\"))","v":""},{"$f":"IF(B31=\"\",\"\",VLOOKUP(B31,'Account code'!A:B,2,FALSE))","v":""},{"$f":"IF($B31=\"\",\"\",IF(Template!D30=\"\",\"\",Template!D30))","v":""},{"$f":"IF($B31=\"\",\"\",IF(Template!E30=\"\",\"\",Template!E30))","v":""},{"$f":"IF($B31=\"\",\"\",IF(Template!F30=\"\",\"\",Template!F30))","v":""},null,{"$f":"IF(B31=\"\",\"\",IF(Template!I30=\"\",\"\",Template!I30))","v":""},{"$f":"IF($B31=\"\",\"\",IF(Template!H30=\"\",\"\",Template!H30))","v":""}]
[null,{"$f":"IF(Template!B31=\"\",\"\",IF(Template!$F$12=\"Y\",Template!B31,\"\"))","v":""},{"$f":"IF(B32=\"\",\"\",VLOOKUP(B32,'Account code'!A:B,2,FALSE))","v":""},{"$f":"IF($B32=\"\",\"\",IF(Template!D31=\"\",\"\",Template!D31))","v":""},{"$f":"IF($B32=\"\",\"\",IF(Template!E31=\"\",\"\",Template!E31))","v":""},{"$f":"IF($B32=\"\",\"\",IF(Template!F31=\"\",\"\",Template!F31))","v":""},null,{"$f":"IF(B32=\"\",\"\",IF(Template!I31=\"\",\"\",Template!I31))","v":""},{"$f":"IF($B32=\"\",\"\",IF(Template!H31=\"\",\"\",Template!H31))","v":""}]
[null,{"$f":"IF(Template!B32=\"\",\"\",IF(Template!$F$12=\"Y\",Template!B32,\"\"))","v":""},{"$f":"IF(B33=\"\",\"\",VLOOKUP(B33,'Account code'!A:B,2,FALSE))","v":""},{"$f":"IF($B33=\"\",\"\",IF(Template!D32=\"\",\"\",Template!D32))","v":""},{"$f":"IF($B33=\"\",\"\",IF(Template!E32=\"\",\"\",Template!E32))","v":""},{"$f":"IF($B33=\"\",\"\",IF(Template!F32=\"\",\"\",Template!F32))","v":""},null,{"$f":"IF(B33=\"\",\"\",IF(Template!I32=\"\",\"\",Template!I32))","v":""},{"$f":"IF($B33=\"\",\"\",IF(Template!H32=\"\",\"\",Template!H32))","v":""}]
[null,{"$f":"IF(Template!B33=\"\",\"\",IF(Template!$F$12=\"Y\",Template!B33,\"\"))","v":""},{"$f":"IF(B34=\"\",\"\",VLOOKUP(B34,'Account code'!A:B,2,FALSE))","v":""},{"$f":"IF($B34=\"\",\"\",IF(Template!D33=\"\",\"\",Template!D33))","v":""},{"$f":"IF($B34=\"\",\"\",IF(Template!E33=\"\",\"\",Template!E33))","v":""},{"$f":"IF($B34=\"\",\"\",IF(Template!F33=\"\",\"\",Template!F33))","v":""},null,{"$f":"IF(B34=\"\",\"\",IF(Template!I33=\"\",\"\",Template!I33))","v":""},{"$f":"IF($B34=\"\",\"\",IF(Template!H33=\"\",\"\",Template!H33))","v":""}]
[null,{"$f":"IF(Template!B34=\"\",\"\",IF(Template!$F$12=\"Y\",Template!B34,\"\"))","v":""},{"$f":"IF(B35=\"\",\"\",VLOOKUP(B35,'Account code'!A:B,2,FALSE))","v":""},{"$f":"IF($B35=\"\",\"\",IF(Template!D34=\"\",\"\",Template!D34))","v":""},{"$f":"IF($B35=\"\",\"\",IF(Template!E34=\"\",\"\",Template!E34))","v":""},{"$f":"IF($B35=\"\",\"\",IF(Template!F34=\"\",\"\",Template!F34))","v":""},null,{"$f":"IF(B35=\"\",\"\",IF(Template!I34=\"\",\"\",Template!I34))","v":""},{"$f":"IF($B35=\"\",\"\",IF(Template!H34=\"\",\"\",Template!H34))","v":""}]
[null,{"$f":"IF(Template!B35=\"\",\"\",IF(Template!$F$12=\"Y\",Template!B35,\"\"))","v":""},{"$f":"IF(B36=\"\",\"\",VLOOKUP(B36,'Account code'!A:B,2,FALSE))","v":""},{"$f":"IF($B36=\"\",\"\",IF(Template!D35=\"\",\"\",Template!D35))","v":""},{"$f":"IF($B36=\"\",\"\",IF(Template!E35=\"\",\"\",Template!E35))","v":""},{"$f":"IF($B36=\"\",\"\",IF(Template!F35=\"\",\"\",Template!F35))","v":""},null,{"$f":"IF(B36=\"\",\"\",IF(Template!I35=\"\",\"\",Template!I35))","v":""},{"$f":"IF($B36=\"\",\"\",IF(Template!H35=\"\",\"\",Template!H35))","v":""}]
[null,{"$f":"IF(Template!B36=\"\",\"\",IF(Template!$F$12=\"Y\",Template!B36,\"\"))","v":""},{"$f":"IF(B37=\"\",\"\",VLOOKUP(B37,'Account code'!A:B,2,FALSE))","v":""},{"$f":"IF($B37=\"\",\"\",IF(Template!D36=\"\",\"\",Template!D36))","v":""},{"$f":"IF($B37=\"\",\"\",IF(Template!E36=\"\",\"\",Template!E36))","v":""},{"$f":"IF($B37=\"\",\"\",IF(Template!F36=\"\",\"\",Template!F36))","v":""},null,{"$f":"IF(B37=\"\",\"\",IF(Template!I36=\"\",\"\",Template!I36))","v":""},{"$f":"IF($B37=\"\",\"\",IF(Template!H36=\"\",\"\",Template!H36))","v":""}]
[null,{"$f":"IF(Template!B37=\"\",\"\",IF(Template!$F$12=\"Y\",Template!B37,\"\"))","v":""},{"$f":"IF(B38=\"\",\"\",VLOOKUP(B38,'Account code'!A:B,2,FALSE))","v":""},{"$f":"IF($B38=\"\",\"\",IF(Template!D37=\"\",\"\",Template!D37))","v":""},{"$f":"IF($B38=\"\",\"\",IF(Template!E37=\"\",\"\",Template!E37))","v":""},{"$f":"IF($B38=\"\",\"\",IF(Template!F37=\"\",\"\",Template!F37))","v":""},null,{"$f":"IF(B38=\"\",\"\",IF(Template!I37=\"\",\"\",Template!I37))","v":""},{"$f":"IF($B38=\"\",\"\",IF(Template!H37=\"\",\"\",Template!H37))","v":""}]
[null,{"$f":"IF(Template!B38=\"\",\"\",IF(Template!$F$12=\"Y\",Template!B38,\"\"))","v":""},{"$f":"IF(B39=\"\",\"\",VLOOKUP(B39,'Account code'!A:B,2,FALSE))","v":""},{"$f":"IF($B39=\"\",\"\",IF(Template!D38=\"\",\"\",Template!D38))","v":""},{"$f":"IF($B39=\"\",\"\",IF(Template!E38=\"\",\"\",Template!E38))","v":""},{"$f":"IF($B39=\"\",\"\",IF(Template!F38=\"\",\"\",Template!F38))","v":""},null,{"$f":"IF(B39=\"\",\"\",IF(Template!I38=\"\",\"\",Template!I38))","v":""},{"$f":"IF($B39=\"\",\"\",IF(Template!H38=\"\",\"\",Template!H38))","v":""}]
[null,{"$f":"IF(Template!B39=\"\",\"\",IF(Template!$F$12=\"Y\",Template!B39,\"\"))","v":""},{"$f":"IF(B40=\"\",\"\",VLOOKUP(B40,'Account code'!A:B,2,FALSE))","v":""},{"$f":"IF($B40=\"\",\"\",IF(Template!D39=\"\",\"\",Template!D39))","v":""},{"$f":"IF($B40=\"\",\"\",IF(Template!E39=\"\",\"\",Template!E39))","v":""},{"$f":"IF($B40=\"\",\"\",IF(Template!F39=\"\",\"\",Template!F39))","v":""},null,{"$f":"IF(B40=\"\",\"\",IF(Template!I39=\"\",\"\",Template!I39))","v":""},{"$f":"IF($B40=\"\",\"\",IF(Template!H39=\"\",\"\",Template!H39))","v":""}]
{"$rows_left_out":11}
{"sheet":"Account code","index":2,"n_rows":333,"n_cols":2,"rows_kept":333,"cut":false,"hidden":false,"merged":[]}
["Account code","Account name"]
[1010,"Cash - SVB Checking"]
[1011,"SVB - Checking (Global)"]
[1015,"Cash - SVB Savings"]
[1020,"Cash - SVB Sweep"]
[1025,"Cash- CoAmerica Checking"]
[1030,"Cash - Comerica Savings"]
[1035,"Cash - Comerica Money"]
[1040,"Cash - Morgan Stanley"]
[1041,"Cash eqivalent - Morgan"]
[1042,"Restricted cash - MS"]
[1050,"Petty cash"]
[1070,"Short Term Investment"]
[1110,"A/R Trade"]
[1120,"Allowance for Bad Debt"]
[1125,"Allowance for return"]
[1170,"Intercompany receivable"]
[1210,"RM - Chemicals"]
[1215,"RM - Cartridges"]
[1220,"RM - Readers"]
[1225,"Inventory - Other"]
[1230,"WIP - Chemicals"]
[1240,"WIP - Cartridges"]
[1250,"WIP - Readers"]
[1260,"FG - Theranos"]
[1265,"FG - Contract MFG"]
[1270,"FG - Distribution Centre"]
[1275,"FG - Used Reader"]
[1280,"Material Review Board"]
[1285,"Warranty Readers"]
[1290,"Std Change Reserve"]
[1291,"Inv Reserve - Readers"]
[1292,"Inv Reserve - Cartridge"]
[1293,"Inv Reserve - Assays"]
[1310,"Prepaid General - ST"]
[1311,"Prepaid Insurance - ST"]
[1312,"Prepaid Rent - ST"]
[1313,"Prepaid Property Taxes"]
[1314,"Prepaid For Amortization"]
[1315,"Prepayments - FinePitch"]
{"$rows_left_out":294}
{"sheet":"Sheet3","index":3,"n_rows":0,"n_cols":0,"rows_kept":0,"cut":false,"hidden":false,"merged":[]}