{"text_format":"1","workbook":"xlsx","n_sheets":4,"sheets":["Spans","Poles","Trees","FEA Tables"],"not_rendered":{"charts":0,"images":0,"macros":1,"external_links":0,"defined_names":48,"comments":0,"pivot_tables":0},"unopened":[],"bounds":{"document_bytes":16777216,"sheet_cells":100000,"rows_first":2000,"rows_last":500,"rows_between":2000,"halvings":0,"cell_chars":16384,"cell_head_chars":4096},"cells_cut":0,"cells_raw":0,"read":"whole","date_system":"1900"}

{"sheet":"Spans","index":0,"n_rows":53,"n_cols":44,"rows_kept":53,"cut":false,"hidden":false,"merged":[[2,7,2,8],[0,6,0,7],[0,18,0,24]]}
["File:",{"$f":"Poles!J3","v":0},null,null,null,null,{"$f":"Poles!I3","v":0},null,{"$f":"Trees!N3","v":"00:00:00"},null,null,null,null,null,null,null,null,"User Inputs","Formula",null,null,null,null,null,null,null,"Long 1","Lat 1","Elev 1",null,"Long 2","Lat 2","Elev 2",null,"Elev 1","Elev 2","Pole1 Height","Pole2 Height"]
["Threat Level","# Spans","(miles)","Weight Factor","Risk Score","Tree≤6ft",null,"Table Group:",0,"objectid","latitude","longitude","HFTD","bst_tag","ast_tag","span_tag","span_lgth","Span Shape","Span ID","Cond. Size","Wind Factor","No. Fail Trees","Threat Level","Tree≤6ft Count","≤6ft Level",null,"(°)","(°)","(m)",null,"(°)","(°)","(m)",null,"(ft)","(ft)","(ft)","(ft)",null,"\"ft\" to \"m\":",0.30480000000000002,null,"\"ft\" to \"mile\":",{"$f":"1/5280","v":1.8939393939393939E-4}]
[3,{"$f":"COUNTIFS(W$3:W$100000,A3)","v":0},{"$f":"SUMIF(W$3:W$100000,A3,Q$3:Q$100000)/5280","v":0},1,{"$f":"B3/B$7*D3","v":0},{"$f":"COUNTIFS(Y$3:Y$100000,A3)","v":0},null,"Span Shape",null,null,null,null,null,null,null,null,null,2,{"$f":"J3","v":0},0,{"$f":"Chk_wind($C$8,AA3,AB3,AE3,AF3)","v":1},{"$f":"COUNTIFS(TreeRange,S3,TreeFail,\"Yes\")*U3","v":0},{"$f":"IF(Q3<1,0,_xlfn.IFS(V3>15,3,V3>5,2,V3>0,1,V3=0,0))","v":0},{"$f":"COUNTIFS(TreeRange,S3,TreeOffset,\"Yes\")","v":0},{"$f":"IF(Q3<1,0,_xlfn.IFS(X3>15,3,X3>5,2,X3>0,1,X3=0,0))","v":0},null,{"$f":"IFERROR(VLOOKUP($N3,PoleRange,3,FALSE),0)","v":0},{"$f":"IFERROR(VLOOKUP($N3,PoleRange,2,FALSE),0)","v":0},{"$f":"(AI3+AK3-1)*0.3048","v":-0.30480000000000002},null,{"$f":"IFERROR(VLOOKUP($O3,PoleRange,3,FALSE),0)","v":0},{"$f":"IFERROR(VLOOKUP($O3,PoleRange,2,FALSE),0)","v":0},{"$f":"(AJ3+AL3-1)*0.3048","v":-0.30480000000000002},null,{"$f":"IFERROR(VLOOKUP($N3,PoleRange,6,FALSE),0)","v":0},{"$f":"IFERROR(VLOOKUP($O3,PoleRange,6,FALSE),0)","v":0},{"$f":"IFERROR(VLOOKUP($N3,PoleRange,7,FALSE),0)","v":0},{"$f":"IFERROR(VLOOKUP($O3,PoleRange,7,FALSE),0)","v":0}]
[2,{"$f":"COUNTIFS(W$3:W$100000,A4)","v":0},{"$f":"SUMIF(W$3:W$100000,A4,Q$3:Q$100000)/5280","v":0},0.75,{"$f":"B4/B$7*D4","v":0},{"$f":"COUNTIFS(Y$3:Y$100000,A4)","v":0},null,2,"Tangent"]
[1,{"$f":"COUNTIFS(W$3:W$100000,A5)","v":0},{"$f":"SUMIF(W$3:W$100000,A5,Q$3:Q$100000)/5280","v":0},0.5,{"$f":"B5/B$7*D5","v":0},{"$f":"COUNTIFS(Y$3:Y$100000,A5)","v":0},null,3,"45° Turn"]
[0,{"$f":"COUNTIFS(W$3:W$100000,A6)","v":1},{"$f":"SUMIF(W$3:W$100000,A6,Q$3:Q$100000)/5280","v":0},0,{"$f":"B6/B$7*D6","v":0},{"$f":"COUNTIFS(Y$3:Y$100000,A6)","v":1},null,4,"90° Turn"]
["Total:",{"$f":"SUM(B3:B6)","v":1},{"$f":"SUM(C3:C6)","v":0},null,{"$f":"SUM(E3:E6)","v":0},null,null,5,"T-Tap"]
[null,"Dominant Wind Dir:",-1,"deg (-1 = Ignore wind effect)",null,null,null,6,"X-Tap"]
[null,"KML Elevation:",-1,"(-1 = Use GL, # = Add to LiDAR)"]
[null,"Pole Height Adj:",0,"ft (to raise allowable)"]
[null,"Tier 2-3 Only?",1,"(1=Yes, 0=No)"]
["FEA Tables:"]
[0,"Zero Allowable"]
[1,{"$f":"'FEA Tables'!C2","v":"Composite, #2 Cu XLPE, Douglas Fir"}]
[2,{"$f":"'FEA Tables'!C16","v":"Composite, #2 Cu XLPE, Pine"}]
[3,{"$f":"'FEA Tables'!C30","v":"Composite, #2 Cu XLPE, Oak"}]
[4,{"$f":"'FEA Tables'!C44","v":"Composite, #2 Cu XLPE, Blue Gum / Eucalyptus"}]
[5,{"$f":"'FEA Tables'!C58","v":"Composite, 1/0 ACSR XLPE, Douglas Fir"}]
[6,{"$f":"'FEA Tables'!C72","v":"Composite, 1/0 ACSR XLPE, Pine"}]
[7,{"$f":"'FEA Tables'!C86","v":"Composite, 1/0 ACSR XLPE, Oak"}]
[8,{"$f":"'FEA Tables'!C100","v":"Composite, 1/0 ACSR XLPE, Blue Gum / Eucalyptus"}]
[9,{"$f":"'FEA Tables'!C114","v":"Composite, 397.5 AAC XLPE, Douglas Fir"}]
[10,{"$f":"'FEA Tables'!C128","v":"Composite, 397.5 AAC XLPE, Pine"}]
[11,{"$f":"'FEA Tables'!C142","v":"Composite, 397.5 AAC XLPE, Oak"}]
[12,{"$f":"'FEA Tables'!C156","v":"Composite, 397.5 AAC XLPE, Blue Gum / Eucalyptus"}]
[13,{"$f":"'FEA Tables'!C170","v":"Composite, 715.5 AAC XLPE, Douglas Fir"}]
[14,{"$f":"'FEA Tables'!C184","v":"Composite, 715.5 AAC XLPE, Pine"}]
[15,{"$f":"'FEA Tables'!C198","v":"Composite, 715.5 AAC XLPE, Oak"}]
[16,{"$f":"'FEA Tables'!C212","v":"Composite, 715.5 AAC XLPE, Blue Gum / Eucalyptus"}]
[17,{"$f":"'FEA Tables'!C226","v":0}]
[18,{"$f":"'FEA Tables'!C240","v":0}]
[19,{"$f":"'FEA Tables'!C254","v":0}]
[20,{"$f":"'FEA Tables'!C268","v":0}]
[21,{"$f":"'FEA Tables'!C282","v":"Wood, #6 Cu, Douglas Fir"}]
[22,{"$f":"'FEA Tables'!C296","v":"Wood, #6 Cu, Pine"}]
[23,{"$f":"'FEA Tables'!C310","v":"Wood, #6 Cu, Oak"}]
[24,{"$f":"'FEA Tables'!C324","v":"Wood, #6 Cu, Blue Gum / Eucalyptus"}]
[25,{"$f":"'FEA Tables'!C338","v":"Wood, 4 (6/1) ACSR, Douglas Fir"}]
[26,{"$f":"'FEA Tables'!C352","v":"Wood, 4 (6/1) ACSR, Pine"}]
[27,{"$f":"'FEA Tables'!C366","v":"Wood, 4 (6/1) ACSR, Oak"}]
[28,{"$f":"'FEA Tables'!C380","v":"Wood, 4 (6/1) ACSR, Blue Gum / Eucalyptus"}]
[29,{"$f":"'FEA Tables'!C394","v":"Wood, 2 (7/1) ACSR, Douglas Fir"}]
[30,{"$f":"'FEA Tables'!C408","v":"Wood, 2 (7/1) ACSR, Pine"}]
[31,{"$f":"'FEA Tables'!C422","v":"Wood, 2 (7/1) ACSR, Oak"}]
[32,{"$f":"'FEA Tables'!C436","v":"Wood, 2 (7/1) ACSR, Blue Gum / Eucalyptus"}]
[33,{"$f":"'FEA Tables'!C450","v":0}]
[34,{"$f":"'FEA Tables'!C464","v":0}]
[35,{"$f":"'FEA Tables'!C478","v":0}]
[36,{"$f":"'FEA Tables'!C492","v":0}]
[37,{"$f":"'FEA Tables'!C506","v":0}]
[38,{"$f":"'FEA Tables'!C520","v":0}]
[39,{"$f":"'FEA Tables'!C534","v":"Wood, 715.5 AAC, Oak"}]
[40,{"$f":"'FEA Tables'!C548","v":"Wood, 715.5 AAC, Blue Gum / Eucalyptus"}]

{"sheet":"Poles","index":1,"n_rows":2,"n_cols":11,"rows_kept":2,"cut":false,"hidden":false,"merged":[]}
[]
["objectid","str_geotag","latitude","longitude","x_coordinate","y_coordinate","elevation","height","line_id","line_name","HFTD"]

{"sheet":"Trees","index":2,"n_rows":3,"n_cols":21,"rows_kept":3,"cut":false,"hidden":false,"merged":[[0,14,0,18]]}
[null,null,null,null,null,null,null,null,null,null,null,null,null,null,"VLOOKUP"]
["ObjectID","TreeID","Latitude","Longitude","Height","Offset","Dist2Wire","Top3Species","PrimarySpecies","Overstrike","SpanTag","HFTD","Fall-In","AcqDate","Span ID","Span Length","Shape","FEA Table","Allowable","Tree Fail?","Offset≤6ft?"]
[null,null,null,null,null,null,null,null,null,null,null,null,null,null,{"$f":"VLOOKUP($K3,SpanRange,4,FALSE)","v":{"$error":"#N/A"}},{"$f":"VLOOKUP($K3,SpanRange,2,FALSE)","v":{"$error":"#N/A"}},{"$f":"VLOOKUP($K3,SpanRange,3,FALSE)","v":{"$error":"#N/A"}},{"$f":"Find_Table(Spans!$I$2,I3)","v":0},{"$f":"IF(R3=0,Spans!$C$10,VLOOKUP(P3,INDIRECT(\"Table\"&R3),Q3,TRUE))","v":0},{"$f":"IFERROR(IF((-1)*J3>S3,\"Yes\",\"No\"),\"No Match\")","v":"No"},{"$f":"IF(F3<=6,\"Yes\",\"No\")","v":"Yes"}]

{"sheet":"FEA Tables","index":3,"n_rows":559,"n_cols":34,"rows_kept":559,"cut":false,"hidden":false,"merged":[[520,2,520,6],[520,9,520,13],[534,2,534,6],[534,9,534,13],[548,2,548,6],[548,9,548,13],[478,2,478,6],[478,9,478,13],[492,2,492,6],[492,9,492,13],[506,2,506,6],[506,9,506,13],[436,2,436,6],[436,9,436,13],[450,2,450,6],[450,9,450,13],[464,2,464,6],[464,9,464,13],[394,2,394,6],[394,9,394,13],[408,2,408,6],[408,9,408,13],[422,2,422,6],[422,9,422,13],[282,2,282,6],[282,9,282,13],[296,2,296,6],[296,9,296,13],[310,2,310,6],[310,9,310,13],[324,2,324,6],[324,9,324,13],[338,2,338,6],[338,9,338,13],[352,2,352,6],[352,9,352,13],[366,2,366,6],[366,9,366,13],[380,2,380,6],[380,9,380,13],[2,9,2,13],[2,2,2,6],[16,9,16,13],[16,2,16,6],[30,9,30,13],[30,2,30,6],[44,9,44,13],[44,2,44,6],[58,9,58,13],[58,2,58,6],[72,9,72,13],[72,2,72,6],[86,9,86,13],[86,2,86,6],[100,9,100,13],[100,2,100,6],[114,9,114,13],[114,2,114,6],[128,9,128,13],[128,2,128,6],[142,9,142,13],[142,2,142,6],[156,9,156,13],[156,2,156,6],[170,9,170,13],[170,2,170,6],[184,9,184,13],[184,2,184,6],[198,9,198,13],[198,2,198,6],[254,9,254,13],[254,2,254,6],[268,9,268,13],[268,2,268,6],[212,9,212,13],[212,2,212,6],[226,9,226,13],[226,2,226,6],[240,9,240,13],[240,2,240,6]]}
[null,null,null,null,null,null,null,null,"TABLE",1,null,null,null,null,null,null,"Conductor","Breaking Strength",null,null,"Tree","Failure","Density","Tip Radius","Ixx","MOR","Static Force Breaking Branch Length (ft)"]
[null,"FEA Table:","Composite, #2 Cu XLPE, Douglas Fir",null,null,null,null,null,"Span Shape:",2,3,4,5,6,null,null,"Doc 059626","(lbf)",null,null,"Species","Mode","(lb/ft3)","(in)","(in4)","(psi)","#6 Cu","4 (6/1) ACSR","2 (7/1) ACSR","715.5 AAC","#2 HD Cu XLPE","1/0 ACSR XLPE","397.5 AAC XLPE","715.5 AAC XLPE"]
[null,"Span",3,null,null,null,null,null,"Span","Adjusted Allowable Overstrike Length (ft)",null,null,null,null,null,null,"#6 Cu",1010,null,null,"Douglas Fir","Trunk",33,3,{"$f":"X3^4*PI()/4","v":63.617251235193308},7700,{"$f":"$Z3*$Y3/$X3/$R$3/12","v":13.472300179070089},{"$f":"$Z3*$Y3/$X3/$R$4/12","v":7.315603860677844},{"$f":"$Z3*$Y3/$X3/$R$5/12","v":3.9326656592083213},{"$f":"$Z3*$Y3/$X3/$R$6/12","v":1.0630486860047492},{"$f":"$Z3*$Y3/$X3/$R$7/12","v":6.0745639200271384},{"$f":"$Z3*$Y3/$X3/$R$8/12","v":3.2709190338607672},{"$f":"$Z3*$Y3/$X3/$R$9/12","v":2.0146614126237474},{"$f":"$Z3*$Y3/$X3/$R$10/12","v":1.1189986168471044}]
[null,"Len (ft)","Tangent","45° Turn","90° Turn","T-Tap","X-Tap",null,"Len (ft)","Tangent","45° Turn","90° Turn","T-Tap","X-Tap",null,null,"4 (6/1) ACSR",1860,null,null,"Pine","Trunk",30,3,{"$f":"X4^4*PI()/4","v":63.617251235193308},5100,{"$f":"$Z4*$Y4/$X4/$R$3/12","v":8.9232118069165534},{"$f":"$Z4*$Y4/$X4/$R$4/12","v":4.8453999596697415},{"$f":"$Z4*$Y4/$X4/$R$5/12","v":2.6047525794756416},{"$f":"$Z4*$Y4/$X4/$R$6/12","v":0.7040971816395093},{"$f":"$Z4*$Y4/$X4/$R$7/12","v":4.0234124665114814},{"$f":"$Z4*$Y4/$X4/$R$8/12","v":2.1664528665831058},{"$f":"$Z4*$Y4/$X4/$R$9/12","v":1.3343861304391058},{"$f":"$Z4*$Y4/$X4/$R$10/12","v":0.74115492804158878}]
[null,1,{"$f":"C6","v":5},{"$f":"D6","v":5},{"$f":"E6","v":5},{"$f":"F6","v":5},{"$f":"G6","v":5},null,1,{"$f":"J6","v":5},{"$f":"K6","v":5},{"$f":"L6","v":5},{"$f":"M6","v":5},{"$f":"N6","v":5},null,null,"2 (7/1) ACSR",3460,null,null,"Oak","Branch",40,3,{"$f":"X5^4*PI()/4","v":63.617251235193308},8200,{"$f":"$Z5*$Y5/$X5/$R$3/12","v":14.347124866022691},{"$f":"$Z5*$Y5/$X5/$R$4/12","v":7.7906430724101723},{"$f":"$Z5*$Y5/$X5/$R$5/12","v":4.1880335591569127},{"$f":"$Z5*$Y5/$X5/$R$6/12","v":1.132077821459603},{"$f":"$Z5*$Y5/$X5/$R$7/12","v":6.4690161226263037},{"$f":"$Z5*$Y5/$X5/$R$8/12","v":3.4833163737218555},{"$f":"$Z5*$Y5/$X5/$R$9/12","v":2.1454835822746401},{"$f":"$Z5*$Y5/$X5/$R$10/12","v":1.191660864694319}]
[null,50,5,5,5,5,5,null,50,{"$f":"C6+Spans!$C$10","v":5},{"$f":"D6+Spans!$C$10","v":5},{"$f":"E6+Spans!$C$10","v":5},{"$f":"F6+Spans!$C$10","v":5},{"$f":"G6+Spans!$C$10","v":5},null,null,"715.5 AAC",12800,null,null,"Blue Gum / Eucalyptus","Branch",51,3,{"$f":"X6^4*PI()/4","v":63.617251235193308},19530,{"$f":"$Z6*$Y6/$X6/$R$3/12","v":34.170652272368677},{"$f":"$Z6*$Y6/$X6/$R$4/12","v":18.555031610264713},{"$f":"$Z6*$Y6/$X6/$R$5/12","v":9.974670171992015},{"$f":"$Z6*$Y6/$X6/$R$6/12","v":2.696278030866591},{"$f":"$Z6*$Y6/$X6/$R$7/12","v":15.407303033523378},{"$f":"$Z6*$Y6/$X6/$R$8/12","v":8.2962400949741273},{"$f":"$Z6*$Y6/$X6/$R$9/12","v":5.1099139465638688},{"$f":"$Z6*$Y6/$X6/$R$10/12","v":2.8381874009122012}]
[null,100,5,5,5,5,5,null,100,{"$f":"C7+Spans!$C$10","v":5},{"$f":"D7+Spans!$C$10","v":5},{"$f":"E7+Spans!$C$10","v":5},{"$f":"F7+Spans!$C$10","v":5},{"$f":"G7+Spans!$C$10","v":5},null,null,"#2 HD Cu XLPE",2240]
[null,150,5,5,5,5,5,null,150,{"$f":"C8+Spans!$C$10","v":5},{"$f":"D8+Spans!$C$10","v":5},{"$f":"E8+Spans!$C$10","v":5},{"$f":"F8+Spans!$C$10","v":5},{"$f":"G8+Spans!$C$10","v":5},null,null,"1/0 ACSR XLPE",4160]
[null,200,5,5,5,5,5,null,200,{"$f":"C9+Spans!$C$10","v":5},{"$f":"D9+Spans!$C$10","v":5},{"$f":"E9+Spans!$C$10","v":5},{"$f":"F9+Spans!$C$10","v":5},{"$f":"G9+Spans!$C$10","v":5},null,null,"397.5 AAC XLPE",6754]
[null,300,5,5,5,5,5,null,300,{"$f":"C10+Spans!$C$10","v":5},{"$f":"D10+Spans!$C$10","v":5},{"$f":"E10+Spans!$C$10","v":5},{"$f":"F10+Spans!$C$10","v":5},{"$f":"G10+Spans!$C$10","v":5},null,null,"715.5 AAC XLPE",12160]
[null,400,5,5,5,5,5,null,400,{"$f":"C11+Spans!$C$10","v":5},{"$f":"D11+Spans!$C$10","v":5},{"$f":"E11+Spans!$C$10","v":5},{"$f":"F11+Spans!$C$10","v":5},{"$f":"G11+Spans!$C$10","v":5}]
[null,500,5,5,5,5,5,null,500,{"$f":"C12+Spans!$C$10","v":5},{"$f":"D12+Spans!$C$10","v":5},{"$f":"E12+Spans!$C$10","v":5},{"$f":"F12+Spans!$C$10","v":5},{"$f":"G12+Spans!$C$10","v":5}]
[null,1000,{"$f":"C12","v":5},{"$f":"D12","v":5},{"$f":"E12","v":5},{"$f":"F12","v":5},{"$f":"G12","v":5},null,1000,{"$f":"J12","v":5},{"$f":"K12","v":5},{"$f":"L12","v":5},{"$f":"M12","v":5},{"$f":"N12","v":5}]
[]
[null,null,null,null,null,null,null,null,"TABLE",2]
[null,"FEA Table:","Composite, #2 Cu XLPE, Pine",null,null,null,null,null,"Span Shape:",2,3,4,5,6]
[null,"Span","Allowable Overstrike Length (ft)",null,null,null,null,null,"Span","Adjusted Allowable Overstrike Length (ft)"]
[null,"Len (ft)","Tangent","45° Turn","90° Turn","T-Tap","X-Tap",null,"Len (ft)","Tangent","45° Turn","90° Turn","T-Tap","X-Tap"]
[null,1,{"$f":"C20","v":5},{"$f":"D20","v":5},{"$f":"E20","v":5},{"$f":"F20","v":5},{"$f":"G20","v":5},null,1,{"$f":"J20","v":5},{"$f":"K20","v":5},{"$f":"L20","v":5},{"$f":"M20","v":5},{"$f":"N20","v":5}]
[null,50,5,5,5,5,5,null,50,{"$f":"C20+Spans!$C$10","v":5},{"$f":"D20+Spans!$C$10","v":5},{"$f":"E20+Spans!$C$10","v":5},{"$f":"F20+Spans!$C$10","v":5},{"$f":"G20+Spans!$C$10","v":5}]
[null,100,5,5,5,5,5,null,100,{"$f":"C21+Spans!$C$10","v":5},{"$f":"D21+Spans!$C$10","v":5},{"$f":"E21+Spans!$C$10","v":5},{"$f":"F21+Spans!$C$10","v":5},{"$f":"G21+Spans!$C$10","v":5}]
[null,150,5,5,5,5,5,null,150,{"$f":"C22+Spans!$C$10","v":5},{"$f":"D22+Spans!$C$10","v":5},{"$f":"E22+Spans!$C$10","v":5},{"$f":"F22+Spans!$C$10","v":5},{"$f":"G22+Spans!$C$10","v":5}]
[null,200,5,5,5,5,5,null,200,{"$f":"C23+Spans!$C$10","v":5},{"$f":"D23+Spans!$C$10","v":5},{"$f":"E23+Spans!$C$10","v":5},{"$f":"F23+Spans!$C$10","v":5},{"$f":"G23+Spans!$C$10","v":5}]
[null,300,5,5,5,5,5,null,300,{"$f":"C24+Spans!$C$10","v":5},{"$f":"D24+Spans!$C$10","v":5},{"$f":"E24+Spans!$C$10","v":5},{"$f":"F24+Spans!$C$10","v":5},{"$f":"G24+Spans!$C$10","v":5}]
[null,400,5,5,5,5,5,null,400,{"$f":"C25+Spans!$C$10","v":5},{"$f":"D25+Spans!$C$10","v":5},{"$f":"E25+Spans!$C$10","v":5},{"$f":"F25+Spans!$C$10","v":5},{"$f":"G25+Spans!$C$10","v":5}]
[null,500,5,5,5,5,5,null,500,{"$f":"C26+Spans!$C$10","v":5},{"$f":"D26+Spans!$C$10","v":5},{"$f":"E26+Spans!$C$10","v":5},{"$f":"F26+Spans!$C$10","v":5},{"$f":"G26+Spans!$C$10","v":5}]
[null,1000,{"$f":"C26","v":5},{"$f":"D26","v":5},{"$f":"E26","v":5},{"$f":"F26","v":5},{"$f":"G26","v":5},null,1000,{"$f":"J26","v":5},{"$f":"K26","v":5},{"$f":"L26","v":5},{"$f":"M26","v":5},{"$f":"N26","v":5}]
[]
[null,null,null,null,null,null,null,null,"TABLE",3]
[null,"FEA Table:","Composite, #2 Cu XLPE, Oak",null,null,null,null,null,"Span Shape:",2,3,4,5,6]
[null,"Span","Allowable Overstrike Length (ft)",null,null,null,null,null,"Span","Adjusted Allowable Overstrike Length (ft)"]
[null,"Len (ft)","Tangent","45° Turn","90° Turn","T-Tap","X-Tap",null,"Len (ft)","Tangent","45° Turn","90° Turn","T-Tap","X-Tap"]
[null,1,{"$f":"C34","v":17},{"$f":"D34","v":17},{"$f":"E34","v":17},{"$f":"F34","v":17},{"$f":"G34","v":17},null,1,{"$f":"J34","v":17},{"$f":"K34","v":17},{"$f":"L34","v":17},{"$f":"M34","v":17},{"$f":"N34","v":17}]
[null,50,17,17,17,17,17,null,50,{"$f":"C34+Spans!$C$10","v":17},{"$f":"D34+Spans!$C$10","v":17},{"$f":"E34+Spans!$C$10","v":17},{"$f":"F34+Spans!$C$10","v":17},{"$f":"G34+Spans!$C$10","v":17}]
[null,100,17,17,17,17,17,null,100,{"$f":"C35+Spans!$C$10","v":17},{"$f":"D35+Spans!$C$10","v":17},{"$f":"E35+Spans!$C$10","v":17},{"$f":"F35+Spans!$C$10","v":17},{"$f":"G35+Spans!$C$10","v":17}]
[null,150,17,17,17,17,17,null,150,{"$f":"C36+Spans!$C$10","v":17},{"$f":"D36+Spans!$C$10","v":17},{"$f":"E36+Spans!$C$10","v":17},{"$f":"F36+Spans!$C$10","v":17},{"$f":"G36+Spans!$C$10","v":17}]
[null,200,17,17,17,17,17,null,200,{"$f":"C37+Spans!$C$10","v":17},{"$f":"D37+Spans!$C$10","v":17},{"$f":"E37+Spans!$C$10","v":17},{"$f":"F37+Spans!$C$10","v":17},{"$f":"G37+Spans!$C$10","v":17}]
[null,300,17,17,17,17,17,null,300,{"$f":"C38+Spans!$C$10","v":17},{"$f":"D38+Spans!$C$10","v":17},{"$f":"E38+Spans!$C$10","v":17},{"$f":"F38+Spans!$C$10","v":17},{"$f":"G38+Spans!$C$10","v":17}]
[null,400,17,17,17,17,17,null,400,{"$f":"C39+Spans!$C$10","v":17},{"$f":"D39+Spans!$C$10","v":17},{"$f":"E39+Spans!$C$10","v":17},{"$f":"F39+Spans!$C$10","v":17},{"$f":"G39+Spans!$C$10","v":17}]
[null,500,17,17,17,17,17,null,500,{"$f":"C40+Spans!$C$10","v":17},{"$f":"D40+Spans!$C$10","v":17},{"$f":"E40+Spans!$C$10","v":17},{"$f":"F40+Spans!$C$10","v":17},{"$f":"G40+Spans!$C$10","v":17}]
[null,1000,{"$f":"C40","v":17},{"$f":"D40","v":17},{"$f":"E40","v":17},{"$f":"F40","v":17},{"$f":"G40","v":17},null,1000,{"$f":"J40","v":17},{"$f":"K40","v":17},{"$f":"L40","v":17},{"$f":"M40","v":17},{"$f":"N40","v":17}]
[]
[null,null,null,null,null,null,null,null,"TABLE",4]
[null,"FEA Table:","Composite, #2 Cu XLPE, Blue Gum / Eucalyptus",null,null,null,null,null,"Span Shape:",2,3,4,5,6]
[null,"Span","Allowable Overstrike Length (ft)",null,null,null,null,null,"Span","Adjusted Allowable Overstrike Length (ft)"]
[null,"Len (ft)","Tangent","45° Turn","90° Turn","T-Tap","X-Tap",null,"Len (ft)","Tangent","45° Turn","90° Turn","T-Tap","X-Tap"]
[null,1,{"$f":"C48","v":17},{"$f":"D48","v":17},{"$f":"E48","v":17},{"$f":"F48","v":17},{"$f":"G48","v":17},null,1,{"$f":"J48","v":17},{"$f":"K48","v":17},{"$f":"L48","v":17},{"$f":"M48","v":17},{"$f":"N48","v":17}]
[null,50,17,17,17,17,17,null,50,{"$f":"C48+Spans!$C$10","v":17},{"$f":"D48+Spans!$C$10","v":17},{"$f":"E48+Spans!$C$10","v":17},{"$f":"F48+Spans!$C$10","v":17},{"$f":"G48+Spans!$C$10","v":17}]
[null,100,17,17,17,17,17,null,100,{"$f":"C49+Spans!$C$10","v":17},{"$f":"D49+Spans!$C$10","v":17},{"$f":"E49+Spans!$C$10","v":17},{"$f":"F49+Spans!$C$10","v":17},{"$f":"G49+Spans!$C$10","v":17}]
[null,150,17,17,17,17,17,null,150,{"$f":"C50+Spans!$C$10","v":17},{"$f":"D50+Spans!$C$10","v":17},{"$f":"E50+Spans!$C$10","v":17},{"$f":"F50+Spans!$C$10","v":17},{"$f":"G50+Spans!$C$10","v":17}]
[null,200,17,17,17,17,17,null,200,{"$f":"C51+Spans!$C$10","v":17},{"$f":"D51+Spans!$C$10","v":17},{"$f":"E51+Spans!$C$10","v":17},{"$f":"F51+Spans!$C$10","v":17},{"$f":"G51+Spans!$C$10","v":17}]
[null,300,17,17,17,17,17,null,300,{"$f":"C52+Spans!$C$10","v":17},{"$f":"D52+Spans!$C$10","v":17},{"$f":"E52+Spans!$C$10","v":17},{"$f":"F52+Spans!$C$10","v":17},{"$f":"G52+Spans!$C$10","v":17}]
[null,400,17,17,17,17,17,null,400,{"$f":"C53+Spans!$C$10","v":17},{"$f":"D53+Spans!$C$10","v":17},{"$f":"E53+Spans!$C$10","v":17},{"$f":"F53+Spans!$C$10","v":17},{"$f":"G53+Spans!$C$10","v":17}]
[null,500,17,17,17,17,17,null,500,{"$f":"C54+Spans!$C$10","v":17},{"$f":"D54+Spans!$C$10","v":17},{"$f":"E54+Spans!$C$10","v":17},{"$f":"F54+Spans!$C$10","v":17},{"$f":"G54+Spans!$C$10","v":17}]
[null,1000,{"$f":"C54","v":17},{"$f":"D54","v":17},{"$f":"E54","v":17},{"$f":"F54","v":17},{"$f":"G54","v":17},null,1000,{"$f":"J54","v":17},{"$f":"K54","v":17},{"$f":"L54","v":17},{"$f":"M54","v":17},{"$f":"N54","v":17}]
[]
[null,null,null,null,null,null,null,null,"TABLE",5]
[null,"FEA Table:","Composite, 1/0 ACSR XLPE, Douglas Fir",null,null,null,null,null,"Span Shape:",2,3,4,5,6,null,null,null,{"$f":"VLOOKUP(100, Table5, 6, FALSE)","v":4}]
[null,"Span","Allowable Overstrike Length (ft)",null,null,null,null,null,"Span","Adjusted Allowable Overstrike Length (ft)"]
[null,"Len (ft)","Tangent","45° Turn","90° Turn","T-Tap","X-Tap",null,"Len (ft)","Tangent","45° Turn","90° Turn","T-Tap","X-Tap"]
[null,1,{"$f":"C62","v":5},{"$f":"D62","v":5},{"$f":"E62","v":5},{"$f":"F62","v":5},{"$f":"G62","v":3},null,1,{"$f":"J62","v":5},{"$f":"K62","v":5},{"$f":"L62","v":5},{"$f":"M62","v":5},{"$f":"N62","v":3}]
[null,50,5,5,5,5,3,null,50,{"$f":"C62+Spans!$C$10","v":5},{"$f":"D62+Spans!$C$10","v":5},{"$f":"E62+Spans!$C$10","v":5},{"$f":"F62+Spans!$C$10","v":5},{"$f":"G62+Spans!$C$10","v":3}]
[null,100,7,7,11,12,4,null,100,{"$f":"C63+Spans!$C$10","v":7},{"$f":"D63+Spans!$C$10","v":7},{"$f":"E63+Spans!$C$10","v":11},{"$f":"F63+Spans!$C$10","v":12},{"$f":"G63+Spans!$C$10","v":4}]
[null,150,7,11,16,13,6,null,150,{"$f":"C64+Spans!$C$10","v":7},{"$f":"D64+Spans!$C$10","v":11},{"$f":"E64+Spans!$C$10","v":16},{"$f":"F64+Spans!$C$10","v":13},{"$f":"G64+Spans!$C$10","v":6}]
[null,200,11,16,16,13,7,null,200,{"$f":"C65+Spans!$C$10","v":11},{"$f":"D65+Spans!$C$10","v":16},{"$f":"E65+Spans!$C$10","v":16},{"$f":"F65+Spans!$C$10","v":13},{"$f":"G65+Spans!$C$10","v":7}]
[null,300,16,16,16,15,12,null,300,{"$f":"C66+Spans!$C$10","v":16},{"$f":"D66+Spans!$C$10","v":16},{"$f":"E66+Spans!$C$10","v":16},{"$f":"F66+Spans!$C$10","v":15},{"$f":"G66+Spans!$C$10","v":12}]
[null,400,19,16,18,15,17,null,400,{"$f":"C67+Spans!$C$10","v":19},{"$f":"D67+Spans!$C$10","v":16},{"$f":"E67+Spans!$C$10","v":18},{"$f":"F67+Spans!$C$10","v":15},{"$f":"G67+Spans!$C$10","v":17}]
[null,500,21,16,22,17,18,null,500,{"$f":"C68+Spans!$C$10","v":21},{"$f":"D68+Spans!$C$10","v":16},{"$f":"E68+Spans!$C$10","v":22},{"$f":"F68+Spans!$C$10","v":17},{"$f":"G68+Spans!$C$10","v":18}]
[null,1000,{"$f":"C68","v":21},{"$f":"D68","v":16},{"$f":"E68","v":22},{"$f":"F68","v":17},{"$f":"G68","v":18},null,1000,{"$f":"J68","v":21},{"$f":"K68","v":16},{"$f":"L68","v":22},{"$f":"M68","v":17},{"$f":"N68","v":18}]
[]
[null,null,null,null,null,null,null,null,"TABLE",6]
[null,"FEA Table:","Composite, 1/0 ACSR XLPE, Pine",null,null,null,null,null,"Span Shape:",2,3,4,5,6]
[null,"Span","Allowable Overstrike Length (ft)",null,null,null,null,null,"Span","Adjusted Allowable Overstrike Length (ft)"]
[null,"Len (ft)","Tangent","45° Turn","90° Turn","T-Tap","X-Tap",null,"Len (ft)","Tangent","45° Turn","90° Turn","T-Tap","X-Tap"]
[null,1,{"$f":"C76","v":6},{"$f":"D76","v":6},{"$f":"E76","v":8},{"$f":"F76","v":7},{"$f":"G76","v":3},null,1,{"$f":"J76","v":6},{"$f":"K76","v":6},{"$f":"L76","v":8},{"$f":"M76","v":7},{"$f":"N76","v":3}]
[null,50,6,6,8,7,3,null,50,{"$f":"C76+Spans!$C$10","v":6},{"$f":"D76+Spans!$C$10","v":6},{"$f":"E76+Spans!$C$10","v":8},{"$f":"F76+Spans!$C$10","v":7},{"$f":"G76+Spans!$C$10","v":3}]
[null,100,10,10,13,15,8,null,100,{"$f":"C77+Spans!$C$10","v":10},{"$f":"D77+Spans!$C$10","v":10},{"$f":"E77+Spans!$C$10","v":13},{"$f":"F77+Spans!$C$10","v":15},{"$f":"G77+Spans!$C$10","v":8}]
[null,150,15,15,18,16,11,null,150,{"$f":"C78+Spans!$C$10","v":15},{"$f":"D78+Spans!$C$10","v":15},{"$f":"E78+Spans!$C$10","v":18},{"$f":"F78+Spans!$C$10","v":16},{"$f":"G78+Spans!$C$10","v":11}]
[null,200,17,20,20,18,16,null,200,{"$f":"C79+Spans!$C$10","v":17},{"$f":"D79+Spans!$C$10","v":20},{"$f":"E79+Spans!$C$10","v":20},{"$f":"F79+Spans!$C$10","v":18},{"$f":"G79+Spans!$C$10","v":16}]
[null,300,22,22,21,20,20,null,300,{"$f":"C80+Spans!$C$10","v":22},{"$f":"D80+Spans!$C$10","v":22},{"$f":"E80+Spans!$C$10","v":21},{"$f":"F80+Spans!$C$10","v":20},{"$f":"G80+Spans!$C$10","v":20}]
{"$rows_left_out":479}